{"text_format":"1","workbook":"xlsx","n_sheets":23,"sheets":["Qtrly. Summary (for IGB use)","Qtly Financial Sumry (for IGB)","Instructions","Chart of Accounts","Questionnaire","Financial Stmt Data Entry","Business Activity","Use Agreement Tracking","1st Qtr.","2nd Qtr.","3rd Qtr.","4th Qtr.","Annual Review","QrtlyGraphs","AnnualGraphs","Graph Data","Selected Disclosures","Shareholders Equity Recon","Debt Schedule","Available Financing","Accts Receivable","Accts Payable","Financial Stmt Change Log"],"not_rendered":{"charts":12,"images":1,"macros":1,"external_links":0,"defined_names":27,"comments":3,"pivot_tables":0},"unopened":[],"bounds":{"document_bytes":16777216,"sheet_cells":100000,"rows_first":2000,"rows_last":500,"rows_between":2000,"halvings":0,"cell_chars":16384,"cell_head_chars":4096},"cells_cut":0,"cells_raw":0,"read":"whole","date_system":"1900"}

{"sheet":"Qtrly. Summary (for IGB use)","index":0,"n_rows":166,"n_cols":2,"rows_kept":166,"cut":false,"hidden":true,"merged":[]}
[null,"XYZ TERMINAL OPERATOR"]
[null,"QUARTELY FINANCIAL ANALYSIS SUMMARY"]
[]
[null,"FIRST QUARTER ENDED MARCH 31, 2013"]
[]
[null,"Number of new use agreements:        Signed     ______"]
{"$rows_left_out":161}
{"sheet":"Qtly Financial Sumry (for IGB)","index":1,"n_rows":63,"n_cols":13,"rows_kept":63,"cut":false,"hidden":true,"merged":[[0,0,0,12],[30,0,30,12]]}
["INCOME STATEMENT"]
[null,null,"1st Qtr",null,"2nd Qtr",null,"3rd qtr",null,"4th qtr",null,"Annual","Adjustments","Annual Financial Statement"]
["Video Gaming"]
["Gross Revenue (Funds In)"]
["Payouts (Funds Out)"]
["Credits"]
{"$rows_left_out":58}
{"sheet":"Instructions","index":2,"n_rows":37,"n_cols":2,"rows_kept":37,"cut":false,"hidden":false,"merged":[[22,0,22,1],[4,0,4,1],[33,0,33,1]]}
[null,"Quarterly Reporting Template Instructions"]
[]
[null,"Last Template Update:  07/19/2021  -  OBTAIN BLANK TEMPLATE ONCE FOR NEW TERMINAL OPERATOR FIRST SUBMISSION-   FOR ALL SUBSEQUENT YEARS USE YOUR PRIOR YEAR TEMPLATE AND ROLL FORWARD FOR THE NEW YEAR PER INSTRUCTIONS BELOW."]
[]
["General Instructions:"]
["1.","Make sure you have enabled macros upon opening the excel workbook.    Depending on your excel security settings, you might see a Security Warning just below the toolbar when you open the file.   Click on Options and Enable this content."]
{"$rows_left_out":32}
{"sheet":"Chart of Accounts","index":3,"n_rows":154,"n_cols":4,"rows_kept":154,"cut":false,"hidden":false,"merged":[]}
["Uniform Chart of Accounts"]
[]
["Primary Financial Statement Category","Financial Statement Sub-category","Account Name","Account Description"]
["Current Asset ","Cash and Cash Equivalents","Cash on hand/Petty Cash","Currency and coin of the United States in hand."]
["Current Asset ","Cash and Cash Equivalents","Cash in bank","Currency and coin of the United States in banks."]
["Current Asset ","Cash and Cash Equivalents","Cash in Redemption Terminals","Currency and coin of the United States in redemption terminals funded by the terminal operator."]
{"$rows_left_out":149}
{"sheet":"Questionnaire","index":4,"n_rows":38,"n_cols":3,"rows_kept":38,"cut":false,"hidden":false,"merged":[[19,1,19,3],[0,0,0,8],[1,0,1,8],[3,0,3,8],[15,2,15,3],[18,1,18,3]]}
["Type Terminal Operator Name and License # Here"]
["Questionnaire"]
[]
["Please complete the following questionnaire.  If changes occur from a prior quarterly submission, update accordingly."]
[]
[]
{"$rows_left_out":33}
{"sheet":"Financial Stmt Data Entry","index":5,"n_rows":257,"n_cols":12,"rows_kept":257,"cut":false,"hidden":false,"merged":[[3,2,4,2],[3,3,4,3],[3,4,4,4],[3,10,4,10],[3,11,4,11],[3,5,4,5],[3,6,4,6],[3,7,4,7],[3,8,4,8],[3,9,4,9]]}
[{"$f":"+Questionnaire!A1","v":"Type Terminal Operator Name and License # Here"}]
[null,"Date of Financial Statement Run:"]
[]
[null,null,2021,{"$f":"\"Q4 \"& +C4","v":"Q4 2021"},{"$f":"\"Q3 \"& +C4","v":"Q3 2021"},{"$f":"\"Q2 \"& +C4","v":"Q2 2021"},{"$f":"\"Q1 \"& +C4","v":"Q1 2021"},{"$f":"\"Q4 \"& +I4","v":"Q4 2020"},{"$f":"+C4-1","v":2020},{"$f":"+I4-1","v":2019},{"$f":"+J4-1","v":2018},{"$f":"+K4-1","v":2017}]
[]
[null,"# of VGT's live at the end of the period",{"$f":"+D6","v":0},null,null,null,null,{"$f":"+I6","v":0}]
{"$rows_left_out":252}
{"sheet":"Business Activity","index":6,"n_rows":24,"n_cols":1,"rows_kept":24,"cut":false,"hidden":false,"merged":[[24,0,24,7],[17,0,17,7],[22,0,22,7],[0,0,0,7],[1,0,1,7],[4,0,4,7],[12,0,12,7],[9,0,9,7],[14,0,14,7],[19,0,19,7],[7,0,7,7]]}
[{"$f":"+'Financial Stmt Data Entry'!A1","v":"Type Terminal Operator Name and License # Here"}]
["CURRENT AND FUTURE BUSINESS ACTIVITY BY QUARTER  "]
[]
[]
["This section is to be used to briefly explain any significant business related activity that occurred during the quarter;  i.e. acquisiton or sale of business lines, use agreements, large equipment purchases or sales, related party transactions, litigation, etc.  Also, explain any significant future plans scheduled to occur within one year from the end of the current quarter;  i.e. planned acquisition or sale of business lines, use agreements, equipment, incurring or paying off new debt, etc. "]
["Business Activity - Quarter 1:"]
{"$rows_left_out":19}
{"sheet":"Use Agreement Tracking","index":7,"n_rows":5003,"n_cols":19,"rows_kept":5003,"cut":false,"hidden":false,"merged":[[0,1,0,3],[1,1,1,14]]}
[null,{"$f":"+'Financial Stmt Data Entry'!A1","v":"Type Terminal Operator Name and License # Here"}]
[null,"USE AGREEMENT TRACKING  - Purpose: To track all location use agreement activity as well as timing of activity with the Central Communications System.  (Please include all activity, live or not.)                                                                                                                       Please enter dates in the MM/DD/YY format - do NOT enter N/A or TEXT in the date fields."]
[null,"Establishment Name","Street Address","City","County","Zipcode","Business Type","Date Current TO Acquired Use Agreement","Purchased From           (If Applicable)","Date Connected to Sci Games under Current TO","Part of a Revenue Share","Revenue Sharer","Change in Agreement Status","Date Use Agreement Sold, Expired, Revoked, Denied, Business Closed                  (If Applicable)","Sold To                          (If applicable)"]
[1]
[2,null,null,null,null,null,null,null,null,null,null,null,null,null,null,null,null,null,"Liquor (Retail)"]
[3,null,null,null,null,null,null,null,null,null,null,null,null,null,null,null,null,null,"Truck Stop"]
{"$rows_left_out":4998}
{"sheet":"1st Qtr.","index":8,"n_rows":83,"n_cols":10,"rows_kept":83,"cut":false,"hidden":false,"merged":[[82,7,82,9],[77,7,77,9],[78,7,78,9],[79,7,79,9],[80,7,80,9],[81,7,81,9],[0,0,0,9],[1,0,1,9],[18,9,19,9],[76,7,76,9],[50,9,51,9]]}
[{"$f":"+'Financial Stmt Data Entry'!A1","v":"Type Terminal Operator Name and License # Here"}]
["Q1 Financial Summary"]
[]
["GAMING STATISTIC SUMMARY",{"$f":"+'Financial Stmt Data Entry'!G4","v":"Q1 2021"},null,"Acquired/",null,"Sold/",null,{"$f":"+B4","v":"Q1 2021"}]
[null,"Beginning",null,"Installed",null,"Removed",null,"Ending"]
["No. of Live Establishments",{"$f":"COUNTIF('Use Agreement Tracking'!J4:J1048576,\"<=\"&'Graph Data'!A24)-COUNTIFS('Use Agreement Tracking'!N4:N1048576,\"<=\"&'Graph Data'!A24,'Use Agreement Tracking'!J4:J1048576,\"<>\")","v":0},null,{"$f":"COUNTIFS('Use Agreement Tracking'!J4:J65000,\">\"&'Graph Data'!A24,'Use Agreement Tracking'!J4:J65000,\"<=\"&'Graph Data'!A20)","v":0},null,{"$f":"COUNTIFS('Use Agreement Tracking'!N4:N65000,\">\"&'Graph Data'!A24,'Use Agreement Tracking'!N4:N65000,\"<=\"&'Graph Data'!A20,'Use Agreement Tracking'!J4:J65000,\"<>\")","v":0},null,{"$f":"+B6+D6-F6","v":0}]
{"$rows_left_out":78}
{"sheet":"2nd Qtr.","index":9,"n_rows":83,"n_cols":10,"rows_kept":83,"cut":false,"hidden":false,"merged":[[82,7,82,9],[77,7,77,9],[78,7,78,9],[79,7,79,9],[80,7,80,9],[81,7,81,9],[0,0,0,9],[1,0,1,9],[18,9,19,9],[50,9,51,9],[76,7,76,9]]}
[{"$f":"+'Financial Stmt Data Entry'!A1","v":"Type Terminal Operator Name and License # Here"}]
["Q2 Financial Summary"]
[]
["GAMING STATISTIC SUMMARY",{"$f":"+'Financial Stmt Data Entry'!F4:F5","v":"Q2 2021"},null,"Acquired/",null,"Sold/",null,{"$f":"+B4","v":"Q2 2021"}]
[null,"Beginning",null,"Installed",null,"Removed",null,"Ending"]
["No. of Live Establishments",{"$f":"+'1st Qtr.'!H6","v":0},null,{"$f":"COUNTIFS('Use Agreement Tracking'!J4:J65000,\">\"&'Graph Data'!A20,'Use Agreement Tracking'!J4:J65000,\"<=\"&'Graph Data'!A21)","v":0},null,{"$f":"COUNTIFS('Use Agreement Tracking'!N4:N65000,\">\"&'Graph Data'!A20,'Use Agreement Tracking'!N4:N65000,\"<=\"&'Graph Data'!A21,'Use Agreement Tracking'!J4:J65000,\"<>\")","v":0},null,{"$f":"+B6+D6-F6","v":0}]
{"$rows_left_out":78}
{"sheet":"3rd Qtr.","index":10,"n_rows":83,"n_cols":10,"rows_kept":83,"cut":false,"hidden":false,"merged":[[82,7,82,9],[77,7,77,9],[78,7,78,9],[79,7,79,9],[80,7,80,9],[81,7,81,9],[0,0,0,9],[1,0,1,9],[18,9,19,9],[50,9,51,9],[76,7,76,9]]}
[{"$f":"+'Financial Stmt Data Entry'!A1","v":"Type Terminal Operator Name and License # Here"}]
["Q3 Financial Summary"]
[]
["GAMING STATISTIC SUMMARY",{"$f":"+'Financial Stmt Data Entry'!E4","v":"Q3 2021"},null,"Acquired/",null,"Sold/",null,{"$f":"+B4","v":"Q3 2021"}]
[null,"Beginning",null,"Installed",null,"Removed",null,"Ending"]
["No. of Live Establishments",{"$f":"+'2nd Qtr.'!H6","v":0},null,{"$f":"COUNTIFS('Use Agreement Tracking'!J4:J65000,\">\"&'Graph Data'!A21,'Use Agreement Tracking'!J4:J65000,\"<=\"&'Graph Data'!A22)","v":0},null,{"$f":"COUNTIFS('Use Agreement Tracking'!N4:N65000,\">\"&'Graph Data'!A21,'Use Agreement Tracking'!N4:N65000,\"<=\"&'Graph Data'!A22,'Use Agreement Tracking'!J4:J65000,\"<>\")","v":0},null,{"$f":"+B6+D6-F6","v":0}]
{"$rows_left_out":78}
{"sheet":"4th Qtr.","index":11,"n_rows":83,"n_cols":10,"rows_kept":83,"cut":false,"hidden":false,"merged":[[82,7,82,9],[77,7,77,9],[78,7,78,9],[79,7,79,9],[80,7,80,9],[81,7,81,9],[0,0,0,9],[1,0,1,9],[18,9,19,9],[50,9,51,9],[76,7,76,9]]}
[{"$f":"+'Financial Stmt Data Entry'!A1","v":"Type Terminal Operator Name and License # Here"}]
["Q4 Financial Summary"]
[]
["GAMING STATISTIC SUMMARY",{"$f":"+'Financial Stmt Data Entry'!D4","v":"Q4 2021"},null,"Acquired/",null,"Sold/",null,{"$f":"+B4","v":"Q4 2021"}]
[null,"Beginning",null,"Installed",null,"Removed",null,"Ending"]
["No. of Live Establishments",{"$f":"+'3rd Qtr.'!H6","v":0},null,{"$f":"COUNTIFS('Use Agreement Tracking'!J4:J65000,\">\"&'Graph Data'!A22,'Use Agreement Tracking'!J4:J65000,\"<=\"&'Graph Data'!A23)","v":0},null,{"$f":"COUNTIFS('Use Agreement Tracking'!N4:N65000,\">\"&'Graph Data'!A22,'Use Agreement Tracking'!N4:N65000,\"<=\"&'Graph Data'!A23,'Use Agreement Tracking'!J4:J65000,\"<>\")","v":0},null,{"$f":"+B6+D6-F6","v":0}]
{"$rows_left_out":78}
{"sheet":"Annual Review","index":12,"n_rows":82,"n_cols":10,"rows_kept":82,"cut":false,"hidden":false,"merged":[[81,7,81,9],[76,7,76,9],[77,7,77,9],[78,7,78,9],[79,7,79,9],[80,7,80,9],[0,0,0,9],[1,0,1,9],[17,9,18,9],[49,9,50,9],[75,7,75,9]]}
[{"$f":"+'Financial Stmt Data Entry'!A1","v":"Type Terminal Operator Name and License # Here"}]
["Annual Financial Summary"]
[]
["GAMING STATISTIC SUMMARY",{"$f":"+'Financial Stmt Data Entry'!I4","v":2020},null,"Acquired/ Installed",null,"Sold/  Removed",null,{"$f":"+'Financial Stmt Data Entry'!C4","v":2021}]
["No. of Live Establishments",{"$f":"COUNTIF('Use Agreement Tracking'!J4:J65000,\"<=\"&'Graph Data'!A24)-COUNTIFS('Use Agreement Tracking'!N4:N65000,\"<=\"&'Graph Data'!A24,'Use Agreement Tracking'!J4:J65000,\"<>\")","v":0},null,{"$f":"+'1st Qtr.'!D6+'2nd Qtr.'!D6+'3rd Qtr.'!D6+'4th Qtr.'!D6","v":0},null,{"$f":"+'1st Qtr.'!F6+'2nd Qtr.'!F6+'3rd Qtr.'!F6+'4th Qtr.'!F6","v":0},null,{"$f":"+B5+D5-F5","v":0}]
["No. of VGTs",{"$f":"+'Financial Stmt Data Entry'!I6","v":0},null,{"$f":"+'4th Qtr.'!D7+'3rd Qtr.'!D7+'2nd Qtr.'!D7+'1st Qtr.'!D7","v":0},null,{"$f":"+'4th Qtr.'!F7+'3rd Qtr.'!F7+'2nd Qtr.'!F7+'1st Qtr.'!F7","v":0},null,{"$f":"+B6+D6-F6","v":0},null,{"$f":"IF(H6<>'Financial Stmt Data Entry'!D6,\"Does Not Match Financial Stmt Data Entry\",\"\")","v":""}]
{"$rows_left_out":77}
{"sheet":"QrtlyGraphs","index":13,"n_rows":2,"n_cols":1,"rows_kept":2,"cut":false,"hidden":false,"merged":[[0,0,0,15],[1,0,1,15]]}
[{"$f":"+'Financial Stmt Data Entry'!A1","v":"Type Terminal Operator Name and License # Here"}]
["Quarterly Trend Analysis"]

{"sheet":"AnnualGraphs","index":14,"n_rows":2,"n_cols":1,"rows_kept":2,"cut":false,"hidden":false,"merged":[[0,0,0,15],[1,0,1,15]]}
[{"$f":"+'Financial Stmt Data Entry'!A1","v":"Type Terminal Operator Name and License # Here"}]
["Annual Trend Analysis  (To be reviewed at year end.)"]

{"sheet":"Graph Data","index":15,"n_rows":25,"n_cols":14,"rows_kept":25,"cut":false,"hidden":true,"merged":[]}
["Graph  Data"]
[]
[null,"Revenue","NTI","Amusement & Other","Gross Profit Margin","Avg WPU","Net Profit","Net Profit Margin","Aggregate Hold","Return on Assets","Debt Ratio","Liability Ratio","Net Working Capital Ratio","VGT's"]
[{"$f":"+'Financial Stmt Data Entry'!L4","v":2017},{"$f":"+'Financial Stmt Data Entry'!$L22","v":0},{"$f":"+'Financial Stmt Data Entry'!$L13","v":0},{"$f":"+'Financial Stmt Data Entry'!L$20","v":0},{"$f":"IFERROR(+'Financial Stmt Data Entry'!L$68/'Financial Stmt Data Entry'!L$22,0)","v":0},null,{"$f":"+'Financial Stmt Data Entry'!$L136","v":0},{"$f":"IFERROR(G4/B4,0)","v":0},null,{"$f":"IFERROR(+'Financial Stmt Data Entry'!L$136/((+'Financial Stmt Data Entry'!L$198)/1),0)","v":0},{"$f":"IFERROR((+'Financial Stmt Data Entry'!L$206+'Financial Stmt Data Entry'!L$236)/'Financial Stmt Data Entry'!L$198,0)","v":0},{"$f":"IFERROR(+'Financial Stmt Data Entry'!L$242/'Financial Stmt Data Entry'!L$198,0)","v":0},{"$f":"IFERROR((+'Financial Stmt Data Entry'!L$168-'Financial Stmt Data Entry'!L$229)/'Financial Stmt Data Entry'!L$198,0)","v":0},{"$f":"+'Financial Stmt Data Entry'!L$6","v":0}]
[{"$f":"+'Financial Stmt Data Entry'!K4","v":2018},{"$f":"+'Financial Stmt Data Entry'!$K22","v":0},{"$f":"+'Financial Stmt Data Entry'!$K13","v":0},{"$f":"+'Financial Stmt Data Entry'!K$20","v":0},{"$f":"IFERROR(+'Financial Stmt Data Entry'!K$68/'Financial Stmt Data Entry'!K$22,0)","v":0},null,{"$f":"+'Financial Stmt Data Entry'!$K136","v":0},{"$f":"IFERROR(G5/B5,0)","v":0},null,{"$f":"IFERROR(+'Financial Stmt Data Entry'!K$136/((+'Financial Stmt Data Entry'!L$198+'Financial Stmt Data Entry'!K$198)/2),0)","v":0},{"$f":"IFERROR((+'Financial Stmt Data Entry'!K$206+'Financial Stmt Data Entry'!K$236)/'Financial Stmt Data Entry'!K$198,0)","v":0},{"$f":"IFERROR(+'Financial Stmt Data Entry'!K$242/'Financial Stmt Data Entry'!K$198,0)","v":0},{"$f":"IFERROR((+'Financial Stmt Data Entry'!K$168-'Financial Stmt Data Entry'!K$229)/'Financial Stmt Data Entry'!K$198,0)","v":0},{"$f":"+'Financial Stmt Data Entry'!K$6","v":0}]
[{"$f":"+'Financial Stmt Data Entry'!J4","v":2019},{"$f":"+'Financial Stmt Data Entry'!$J22","v":0},{"$f":"+'Financial Stmt Data Entry'!$J13","v":0},{"$f":"+'Financial Stmt Data Entry'!J$20","v":0},{"$f":"IFERROR(+'Financial Stmt Data Entry'!J$68/'Financial Stmt Data Entry'!J$22,0)","v":0},0,{"$f":"+'Financial Stmt Data Entry'!$J136","v":0},0,0,{"$f":"IFERROR(+'Financial Stmt Data Entry'!J$136/((+'Financial Stmt Data Entry'!J$198+'Financial Stmt Data Entry'!K$198)/2),0)","v":0},{"$f":"IFERROR((+'Financial Stmt Data Entry'!J$206+'Financial Stmt Data Entry'!J$236)/'Financial Stmt Data Entry'!J$198,0)","v":0},{"$f":"IFERROR(+'Financial Stmt Data Entry'!J$242/'Financial Stmt Data Entry'!J$198,0)","v":0},{"$f":"IFERROR((+'Financial Stmt Data Entry'!J$168-'Financial Stmt Data Entry'!J$229)/'Financial Stmt Data Entry'!J$198,0)","v":0},{"$f":"+'Financial Stmt Data Entry'!J$6","v":0}]
{"$rows_left_out":20}
{"sheet":"Selected Disclosures","index":16,"n_rows":57,"n_cols":8,"rows_kept":57,"cut":false,"hidden":false,"merged":[[31,0,31,7],[0,0,0,7],[3,0,3,4],[12,0,12,3],[21,0,21,7],[1,0,1,7]]}
[{"$f":"+'Financial Stmt Data Entry'!A1","v":"Type Terminal Operator Name and License # Here"}]
["SELECTED DISCLOSURES"]
[]
["LIST OF ALL ACTIVE REVENUE SHARE AGREEMENTS (Note \"none\" if not applicable):"]
["Date of Executed Agreement","Name of Revenue Sharer","Address","# of locations","Terms of Revenue Share","Date Disclosure Information filed with IGB*"]
[]
{"$rows_left_out":52}
{"sheet":"Shareholders Equity Recon","index":17,"n_rows":22,"n_cols":10,"rows_kept":22,"cut":false,"hidden":false,"merged":[[0,0,0,9],[1,0,1,9]]}
[{"$f":"+'Financial Stmt Data Entry'!A1","v":"Type Terminal Operator Name and License # Here"}]
["Stockholders Equity Reconciliation"]
[]
[]
[]
[null,{"$f":"+'Financial Stmt Data Entry'!L4","v":2017},{"$f":"+'Financial Stmt Data Entry'!K4","v":2018},{"$f":"+'Financial Stmt Data Entry'!J4","v":2019},{"$f":"+'Financial Stmt Data Entry'!I4","v":2020},{"$f":"+'Financial Stmt Data Entry'!G4","v":"Q1 2021"},{"$f":"+'Financial Stmt Data Entry'!F4","v":"Q2 2021"},{"$f":"+'Financial Stmt Data Entry'!E4","v":"Q3 2021"},{"$f":"+'Financial Stmt Data Entry'!D4","v":"Q4 2021"},{"$f":"+'Financial Stmt Data Entry'!C4","v":2021}]
{"$rows_left_out":17}
{"sheet":"Debt Schedule","index":18,"n_rows":94,"n_cols":19,"rows_kept":94,"cut":false,"hidden":false,"merged":[[0,0,0,18],[1,0,1,18],[51,0,51,4],[54,0,54,1],[4,6,4,7],[3,6,3,7],[3,8,3,9],[4,8,4,9]]}
[{"$f":"+'Financial Stmt Data Entry'!A1","v":"Type Terminal Operator Name and License # Here"}]
["FINANCIAL DEBT SCHEDULE"]
[]
[null,null,"Date of ",null,null,null,"Balance Due",null,"Balance Due",null,"Balance Due",null,"Balance Due",null,null,null,null,"Debt  Covenants             "]
[null,null,"Last",null,null,null,{"$f":"+'Financial Stmt Data Entry'!G4","v":"Q1 2021"},null,{"$f":"+'Financial Stmt Data Entry'!F4","v":"Q2 2021"},null,{"$f":"+'Financial Stmt Data Entry'!E4","v":"Q3 2021"},null,{"$f":"+'Financial Stmt Data Entry'!D4","v":"Q4 2021"},null,"Interest","Maturity","List all Debt Covenants","Met? *"]
["Lender","Loan #","Draw","Type","Purpose","Amount Drawn","Current","Long-Term","Current","Long-Term","Current","Long-Term","Current","Long-Term","Rate","Date","(If None, enter n/a)","Yes/No","List Covenants Not Met"]
{"$rows_left_out":89}
{"sheet":"Available Financing","index":19,"n_rows":37,"n_cols":12,"rows_kept":37,"cut":false,"hidden":false,"merged":[[3,4,3,5],[3,6,3,7],[3,8,3,9],[3,10,3,11],[0,0,0,11],[1,0,1,11]]}
[{"$f":"+Questionnaire!A1","v":"Type Terminal Operator Name and License # Here"}]
["Financing Review"]
[]
[null,"Approved","Date of","Date","Q1",null,"Q2 ",null,"Q3",null,"Q4"]
[null,"Financing","Executed","Sent","Life-To-Date","Financing","Life-To-Date","Financing","Life-To-Date","Financing","Life-To-Date","Financing"]
["Vendor","Amount","Agreement","To IGB","Draws","Available","Draws","Available","Draws","Available","Draws","Available"]
{"$rows_left_out":32}
{"sheet":"Accts Receivable","index":20,"n_rows":71,"n_cols":13,"rows_kept":71,"cut":false,"hidden":false,"merged":[[0,0,0,8],[37,0,37,8],[54,0,54,8],[1,0,1,8],[2,0,2,8]]}
[{"$f":"+'Financial Stmt Data Entry'!A1","v":"Type Terminal Operator Name and License # Here"}]
["AGED LISTING OF ACCOUNTS RECEIVABLE"]
["List all Gaming receivables separately - Gaming includes establishments, gaming suppliers and other terminal operators."]
[null,null,null,null,null,null,null,null,null,null,null,null,"Gaming"]
[{"$f":"+'Financial Stmt Data Entry'!G4","v":"Q1 2021"},null,null,null,null,null,null,null,null,null,null,null,"Other"]
["Customer (Provide Detailed List)","Industry","Total","Current","30 Days","60 Days","90 Days","180+ Days","Explanation for over 90 days"]
{"$rows_left_out":66}
{"sheet":"Accts Payable","index":21,"n_rows":124,"n_cols":13,"rows_kept":124,"cut":false,"hidden":false,"merged":[[0,0,0,8],[1,0,1,8],[2,0,2,8]]}
[{"$f":"+'Financial Stmt Data Entry'!A1","v":"Type Terminal Operator Name and License # Here"}]
["AGED LISTING OF ACCOUNTS PAYABLE"]
["List all Gaming payables separately - Gaming includes establishments, gaming suppliers, other terminal operators and gaming license/tax authorities.  Include an AP Vendor Payments listing with year to date activity with each quarterly submission."]
[{"$f":"+'Financial Stmt Data Entry'!G4","v":"Q1 2021"},null,null,null,null,null,null,null,null,null,null,null,"Gaming"]
["Vendor (Provide Detailed Listing)","Industry","Total","Current","30 Days","60 Days","90 Days","180+ Days","Explanation for over 90 days"]
[null,"Gaming",{"$f":"SUM(D6:H6)","v":0}]
{"$rows_left_out":119}
{"sheet":"Financial Stmt Change Log","index":22,"n_rows":11,"n_cols":9,"rows_kept":11,"cut":false,"hidden":false,"merged":[[2,0,2,5]]}
[{"$f":"+Questionnaire!A1","v":"Type Terminal Operator Name and License # Here"},null,null,null,null,null,null,null,"Yes"]
["Financial Statement Change Log ",null,null,null,null,null,null,null,"No"]
["(List journal entries posted to a prior reporting period; update financial stmt data entry and upload updated template, financial statements and amended return when applicable.)"]
[]
[]
["Date","Financial",null,null,null,"Amended"]
{"$rows_left_out":5}